Reaction Details
TargetBile salt export pump
LigandBDBM21363
Substrate/Competitorn/a
Meas. Tech.ChEMBL_1661982 (CHEMBL4011663)
IC50 41700±n/a nM
Citation Morgan, RETrauner, Mvan Staden, CJLee, PHRamachandran, BEschenberg, MAfshari, CAQualls, CWLightfoot-Dunn, RHamadeh, HK Interference with bile salt export pump function is a susceptibility factor for human liver injury in drug development. Toxicol Sci118:485-500 (2010) 
 
Bile salt export pump
Name:Bile salt export pump
Type:Protein
Mol. Mass.:146405.49
Organism:Homo sapiens (Human)
Description:O95342
Residue:1321
BDBM21363
NameBDBM21363
Synonyms:12-chloro-9-(2-fluorophenyl)-3-methyl-2,4,8-triazatricyclo[8.4.0.0^{2,6}]tetradeca-1(10),3,5,8,11,13-hexaene CHEMBL655 Midazolam US20230416258, Compound Midazolam
TypeSmall organic molecule
Emp. Form.C18H13ClFN3
Mol. Mass.325.767
SMILESCc1ncc2CN=C(c3ccccc3F)c3cc(Cl)ccc3-n12