Reaction Details
TargetBile salt export pump
LigandBDBM50001285
Substrate/Competitorn/a
Meas. Tech.ChEMBL_1661982 (CHEMBL4011663)
IC50 3500±n/a nM
Citation Morgan, RETrauner, Mvan Staden, CJLee, PHRamachandran, BEschenberg, MAfshari, CAQualls, CWLightfoot-Dunn, RHamadeh, HK Interference with bile salt export pump function is a susceptibility factor for human liver injury in drug development. Toxicol Sci118:485-500 (2010) 
 
Bile salt export pump
Name:Bile salt export pump
Type:Protein
Mol. Mass.:146405.49
Organism:Homo sapiens (Human)
Description:O95342
Residue:1321
BDBM50001285
NameBDBM50001285
Synonyms:(E)-3-((3-(2-(7-chloroquinolin-2-yl)vinyl)phenyl)(3-(dimethylamino)-3-oxopropylthio)methylthio)propanoic acid 3-((3-(2-(7-chloroquinolin-2-yl)vinyl)phenyl)(3-(dimethylamino)-3-oxopropylthio)methylthio)propanoic acid 3-[{3-[(E)-2-(7-Chloro-quinolin-2-yl)-vinyl]-phenyl}-(2-dimethylcarbamoyl-ethylsulfanyl)-methylsulfanyl]-propionic acid 3-[{3-[2-(7-Chloro-quinolin-2-yl)-vinyl]-phenyl}-(2-dimethylcarbamoyl-ethylsulfanyl)-methylsulfanyl]-propionic acid(MK-571, L-660711) L-660711 MK-571
TypeSmall organic molecule
Emp. Form.C26H27ClN2O3S2
Mol. Mass.515.087
SMILESCN(C)C(=O)CCSC(SCCC(O)=O)c1cccc(\C=C\c2ccc3ccc(Cl)cc3n2)c1