Reaction Details
TargetBile salt export pump
LigandBDBM50061101
Substrate/Competitorn/a
Meas. Tech.ChEMBL_1661982 (CHEMBL4011663)
IC50 22000±n/a nM
Citation Morgan, RETrauner, Mvan Staden, CJLee, PHRamachandran, BEschenberg, MAfshari, CAQualls, CWLightfoot-Dunn, RHamadeh, HK Interference with bile salt export pump function is a susceptibility factor for human liver injury in drug development. Toxicol Sci118:485-500 (2010) 
 
Bile salt export pump
Name:Bile salt export pump
Type:Protein
Mol. Mass.:146405.49
Organism:Homo sapiens (Human)
Description:O95342
Residue:1321
BDBM50061101
NameBDBM50061101
Synonyms:4-(1,1-Dimethylethyl)-N-(6-(2-hydroxyethoxy)-5-(2-methoxyphenoxy)-(2,2'-bipyrimidin)-4-yl) benzenesulfornamide BOSENTAN p-tert-Butyl-N-(6-(2-hydroxyethoxy)-5-(o-methoxyphenoxy)-2-(2-pyrimidinyl)-4-pyrimidinyl)benzenesulfonamide
TypeSmall organic molecule
Emp. Form.C27H29N5O6S
Mol. Mass.551.614
SMILESCOc1ccccc1Oc1c(NS(=O)(=O)c2ccc(cc2)C(C)(C)C)nc(nc1OCCO)-c1ncccn1