Reaction Details
TargetSodium-dependent dopamine transporter
LigandBDBM50069813
Substrate/Competitorn/a
Meas. Tech.ChEMBL_1661728 (CHEMBL4011340)
EC50 9.1±n/a nM
Citation Tosh, DKJanowsky, AEshleman, AJWarnick, EGao, ZGChen, ZGizewski, EAuchampach, JASalvemini, DJacobson, KA Scaffold Repurposing of Nucleosides (Adenosine Receptor Agonists): Enhanced Activity at the Human Dopamine and Norepinephrine Sodium Symporters. J Med Chem60:3109-3123 (2017) 
 
Sodium-dependent dopamine transporter
Name:Sodium-dependent dopamine transporter
Type:Multi-pass membrane protein
Mol. Mass.:68497.11
Organism:Homo sapiens (Human)
Description:Q01959
Residue:620
BDBM50069813
NameBDBM50069813
Synonyms:CHEMBL3407785
TypeSmall organic molecule
Emp. Form.C20H19BrN6O3S
Mol. Mass.503.372
SMILES[H][C@]12C[C@]1([C@@H](O)[C@@H](O)[C@@H]2n1cnc2c(NC)nc(nc12)C#Cc1ccc(Br)s1)C(=O)NC