Reaction Details
TargetTransmembrane domain-containing protein TMIGD3
LigandBDBM50236818
Substrate/Competitorn/a
Meas. Tech.ChEMBL_1661723 (CHEMBL4011335)
Ki 18±n/a nM
Citation Tosh, DKJanowsky, AEshleman, AJWarnick, EGao, ZGChen, ZGizewski, EAuchampach, JASalvemini, DJacobson, KA Scaffold Repurposing of Nucleosides (Adenosine Receptor Agonists): Enhanced Activity at the Human Dopamine and Norepinephrine Sodium Symporters. J Med Chem60:3109-3123 (2017) 
 
Transmembrane domain-containing protein TMIGD3
Name:Transmembrane domain-containing protein TMIGD3
Type:PROTEIN
Mol. Mass.:30335.79
Organism:Homo sapiens (Human)
Description:ChEMBL_114868
Residue:266
BDBM50236818
NameBDBM50236818
Synonyms:CHEMBL4068757
TypeSmall organic molecule
Emp. Form.C23H24ClN5O4S
Mol. Mass.501.986
SMILES[H][C@]12C[C@]1([C@@H](O)[C@@H](O)[C@@H]2n1cnc2c(NC)nc(nc12)C#Cc1ccc(Cl)s1)C(=O)OCCCC