Reaction Details
TargetEndoplasmic reticulum aminopeptidase 2
LigandBDBM50236826
Substrate/Competitorn/a
Meas. Tech.ChEBML_1661764
Ki 200±n/a nM
Citation Mpakali, ASaridakis, EHarlos, KZhao, YKokkala, PGeorgiadis, DGiastas, PPapakyriakou, AStratikos, E Ligand-Induced Conformational Change of Insulin-Regulated Aminopeptidase: Insights on Catalytic Mechanism and Active Site Plasticity. J Med Chem60:2963-2972 (2017) 
 
Endoplasmic reticulum aminopeptidase 2
Name:Endoplasmic reticulum aminopeptidase 2
Type:PROTEIN
Mol. Mass.:110463.90
Organism:Homo sapiens (Human)
Description:ChEMBL_1473169
Residue:960
BDBM50236826
NameBDBM50236826
Synonyms:CHEMBL4065841
TypeSmall organic molecule
Emp. Form.C35H40N3O4P
Mol. Mass.597.6836
SMILESN[C@@H](CCc1ccccc1)P(O)(=O)C[C@@H](CC(c1ccccc1)c1ccccc1)C(=O)N[C@@H](Cc1ccccc1)C(N)=O