Reaction Details
TargetE3 ubiquitin-protein ligase Mdm2
LigandBDBM50237752
Substrate/Competitorn/a
Meas. Tech.ChEMBL_1661768 (CHEMBL4011380)
Ki 1.2±n/a nM
Citation Aguilar, ALu, JLiu, LDu, DBernard, DMcEachern, DPrzybranowski, SLi, XLuo, RWen, BSun, DWang, HWen, JWang, GZhai, YGuo, MYang, DWang, S Discovery of 4-((3'R,4'S,5'R)-6¿-Chloro-4'-(3-chloro-2-fluorophenyl)-1'-ethyl-2¿-oxodispiro[cyclohexane-1,2'-pyrrolidine-3',3¿-indoline]-5'-carboxamido)bicyclo[2.2.2]octane-1-carboxylic Acid (AA-115/APG-115): A Potent and Orally Active Murine Double Minute 2 (MDM2) Inhibitor in Clinical Deve J Med Chem60:2819-2839 (2017) 
 
E3 ubiquitin-protein ligase Mdm2
Name:E3 ubiquitin-protein ligase Mdm2
Type:Oncoprotein
Mol. Mass.:55196.54
Organism:Homo sapiens (Human)
Description:Q00987
Residue:491
BDBM50237752
NameBDBM50237752
Synonyms:CHEMBL4095706
TypeSmall organic molecule
Emp. Form.C30H25Cl2F2N3O4
Mol. Mass.600.44
SMILESOC(=O)c1ccc(NC(=O)[C@@H]2NC3(CCCCC3)[C@]3([C@H]2c2cccc(Cl)c2F)C(=O)Nc2cc(Cl)ccc32)c(F)c1