Reaction Details
TargetDual specificity protein kinase CLK2
LigandBDBM50237672
Substrate/Competitorn/a
Meas. Tech.ChEMBL_1662268 (CHEMBL4011949)
IC50 5.3±n/a nM
Citation Irie, TAsami, TSawa, AUno, YHanada, MTaniyama, CFunakoshi, YMasai, HSawa, M Discovery of novel furanone derivatives as potent Cdc7 kinase inhibitors. Eur J Med Chem130:406-418 (2017) 
 
Dual specificity protein kinase CLK2
Name:Dual specificity protein kinase CLK2
Type:n/a
Mol. Mass.:60128.79
Organism:Homo sapiens (Human)
Description:P49760
Residue:499
BDBM50237672
NameBDBM50237672
Synonyms:CHEMBL4089159
TypeSmall organic molecule
Emp. Form.C20H14ClN3O4
Mol. Mass.395.796
SMILESCOC(=O)C1=C(Nc2ccccc2Cl)O\C(=C/c2c[nH]c3ncccc23)C1=O