Reaction Details
TargetCell division cycle 7-related protein kinase/Protein DBF4 homolog A
LigandBDBM50237686
Substrate/Competitorn/a
Meas. Tech.ChEMBL_1662136 (CHEMBL4011817)
IC50 6.7±n/a nM
Citation Irie, TAsami, TSawa, AUno, YHanada, MTaniyama, CFunakoshi, YMasai, HSawa, M Discovery of novel furanone derivatives as potent Cdc7 kinase inhibitors. Eur J Med Chem130:406-418 (2017) 
 
Cell division cycle 7-related protein kinase/Protein DBF4 homolog A
Name:Cell division cycle 7-related protein kinase/Protein DBF4 homolog A
Type:Protein
Mol. Mass.:n/a
Description:n/a
Components:This complex has 2 components.
Component 1
Name:Protein DBF4 homolog A
Synonyms:ASK Chiffon homolog A DBF4-type zinc finger-containing protein 1 DBF4A_HUMAN ZDBF1
Type:Regulatory subunit
Mol. Mass.:76869.65
Organism:Homo sapiens (Human)
Description:n/a
Residue:674
Component 2
Name:Cell division cycle 7-related protein kinase
Synonyms:CDC7 CDC7L1 Cell division cycle 7-related protein kinase (CDC7) huCdc7
Type:Protein
Mol. Mass.:63908.16
Organism:Homo sapiens (Human)
Description:O00311
Residue:574
BDBM50237686
NameBDBM50237686
Synonyms:CHEMBL4062056
TypeSmall organic molecule
Emp. Form.C20H14ClN3O4
Mol. Mass.395.796
SMILESCOC(=O)C1=C(Nc2ccc(Cl)cc2)O\C(=C/c2c[nH]c3ncccc23)C1=O