Reaction Details
TargetP2X purinoceptor 7
LigandBDBM50237704
Substrate/Competitorn/a
Meas. Tech.ChEBML_1662405
IC50 174±n/a nM
Citation O'Brien-Brown, JJackson, AReekie, TABarron, MLWerry, ELSchiavini, PMcDonnell, MMunoz, LWilkinson, SNoll, BWang, SKassiou, M Discovery and pharmacological evaluation of a novel series of adamantyl cyanoguanidines as P2X Eur J Med Chem130:433-439 (2017) 
 
P2X purinoceptor 7
Name:P2X purinoceptor 7
Type:Protein
Mol. Mass.:68602.85
Organism:Homo sapiens (Human)
Description:Q99572
Residue:595
BDBM50237704
NameBDBM50237704
Synonyms:CHEMBL4099941
TypeSmall organic molecule
Emp. Form.C19H23FN4
Mol. Mass.326.4111
SMILESFc1ccc(N\C(NCC23CC4CC(CC(C4)C2)C3)=N\C#N)cc1