Reaction Details
TargetP2X purinoceptor 7
LigandBDBM50237707
Substrate/Competitorn/a
Meas. Tech.ChEMBL_1662405 (CHEMBL4012086)
IC50 9±n/a nM
Citation O'Brien-Brown, JJackson, AReekie, TABarron, MLWerry, ELSchiavini, PMcDonnell, MMunoz, LWilkinson, SNoll, BWang, SKassiou, M Discovery and pharmacological evaluation of a novel series of adamantyl cyanoguanidines as P2X Eur J Med Chem130:433-439 (2017) 
 
P2X purinoceptor 7
Name:P2X purinoceptor 7
Type:Protein
Mol. Mass.:68602.85
Organism:Homo sapiens (Human)
Description:Q99572
Residue:595
BDBM50237707
NameBDBM50237707
Synonyms:A-804598 | CHEMBL1628690
TypeSmall organic molecule
Emp. Form.C19H17N5
Mol. Mass.315.3718
SMILESC[C@H](N\C(Nc1cccc2ncccc12)=N\C#N)c1ccccc1