Reaction Details
TargetP2X purinoceptor 7
LigandBDBM50237726
Substrate/Competitorn/a
Meas. Tech.ChEMBL_1662362 (CHEMBL4012043)
IC50 79±n/a nM
Citation O'Brien-Brown, JJackson, AReekie, TABarron, MLWerry, ELSchiavini, PMcDonnell, MMunoz, LWilkinson, SNoll, BWang, SKassiou, M Discovery and pharmacological evaluation of a novel series of adamantyl cyanoguanidines as P2X Eur J Med Chem130:433-439 (2017) 
 
P2X purinoceptor 7
Name:P2X purinoceptor 7
Type:Protein
Mol. Mass.:68602.85
Organism:Homo sapiens (Human)
Description:Q99572
Residue:595
BDBM50237726
NameBDBM50237726
Synonyms:CHEMBL4070819
TypeSmall organic molecule
Emp. Form.C20H26N4
Mol. Mass.322.4472
SMILESN#C\N=C(\NCc1ccccc1)NCC12CC3CC(CC(C3)C1)C2