Reaction Details
TargetcGMP-specific 3',5'-cyclic phosphodiesterase
LigandBDBM292797
Substrate/Competitorn/a
Meas. Tech.ChEMBL_1661914 (CHEMBL4011526)
IC50 370±n/a nM
Citation Dyck, BBranstetter, BGharbaoui, THudson, ARBreitenbucher, JGGomez, LBotrous, IMarrone, TBarido, RAllerston, CKCedervall, EPXu, RSridhar, VBarker, RAertgeerts, KSchmelzer, KNeul, DLee, DMassari, MEAndersen, CBSebring, KZhou, XPetroski, RLimberis, JAugustin, MChun, LEEdwards, TEPeters, MTabatabaei, A Discovery of Selective Phosphodiesterase 1 Inhibitors with Memory Enhancing Properties. J Med Chem60:3472-3483 (2017) 
 
cGMP-specific 3',5'-cyclic phosphodiesterase
Name:cGMP-specific 3',5'-cyclic phosphodiesterase
Type:Protein
Mol. Mass.:99975.83
Organism:Homo sapiens (Human)
Description:O76074
Residue:875
BDBM292797
NameBDBM292797
Synonyms:US10105367, Example 82 | US10376514, Example 82
TypeSmall organic molecule
Emp. Form.C18H15ClN4OS
Mol. Mass.370.856
SMILESClc1ccc(Cn2c3sc4CCCCc4c3c3ncnn3c2=O)cc1