Reaction Details
TargetPotassium voltage-gated channel subfamily H member 2
LigandBDBM289618
Substrate/Competitorn/a
Meas. Tech.ChEMBL_1661931 (CHEMBL4011543)
IC50 980±n/a nM
Citation Dyck, BBranstetter, BGharbaoui, THudson, ARBreitenbucher, JGGomez, LBotrous, IMarrone, TBarido, RAllerston, CKCedervall, EPXu, RSridhar, VBarker, RAertgeerts, KSchmelzer, KNeul, DLee, DMassari, MEAndersen, CBSebring, KZhou, XPetroski, RLimberis, JAugustin, MChun, LEEdwards, TEPeters, MTabatabaei, A Discovery of Selective Phosphodiesterase 1 Inhibitors with Memory Enhancing Properties. J Med Chem60:3472-3483 (2017) 
 
Potassium voltage-gated channel subfamily H member 2
Name:Potassium voltage-gated channel subfamily H member 2
Type:Multi-pass membrane protein
Mol. Mass.:126672.65
Organism:Homo sapiens (Human)
Description:Q12809
Residue:1159
BDBM289618
NameBDBM289618
Synonyms:6-(4-Chlorobenzyl)-9-(oxetan-3-yl)-8,9,10,11-tetrahydropyrido[4',3':4,5]thieno[3,2-e][1,2,4]triazolo[1,5-c]pyrimidin-5(6H)-one US10376514, Example 106
TypeSmall organic molecule
Emp. Form.C20H18ClN5O2S
Mol. Mass.427.907
SMILESClc1ccc(Cn2c3sc4CN(CCc4c3c3ncnn3c2=O)C2COC2)cc1