Reaction Details
TargetDual specificity calcium/calmodulin-dependent 3',5'-cyclic nucleotide phosphodiesterase 1B
LigandBDBM289621
Substrate/Competitorn/a
Meas. Tech.ChEMBL_1661910 (CHEMBL4011522)
IC50 27±n/a nM
Citation Dyck, BBranstetter, BGharbaoui, THudson, ARBreitenbucher, JGGomez, LBotrous, IMarrone, TBarido, RAllerston, CKCedervall, EPXu, RSridhar, VBarker, RAertgeerts, KSchmelzer, KNeul, DLee, DMassari, MEAndersen, CBSebring, KZhou, XPetroski, RLimberis, JAugustin, MChun, LEEdwards, TEPeters, MTabatabaei, A Discovery of Selective Phosphodiesterase 1 Inhibitors with Memory Enhancing Properties. J Med Chem60:3472-3483 (2017) 
 
Dual specificity calcium/calmodulin-dependent 3',5'-cyclic nucleotide phosphodiesterase 1B
Name:Dual specificity calcium/calmodulin-dependent 3',5'-cyclic nucleotide phosphodiesterase 1B
Type:Enzyme
Mol. Mass.:61366.51
Organism:Homo sapiens (Human)
Description:n/a
Residue:536
BDBM289621
NameBDBM289621
Synonyms:6-(4-Methoxybenzyl)-9-((tetrahydro-2H-pyran-4-yl)methyl)-8,9,10,11-tetrahydropyrido[4',3':4,5]thieno[3,2-e][1,2,4]triazolo[1,5-c]pyrimidin-5(6H)-one US10376514, Example 109
TypeSmall organic molecule
Emp. Form.C24H27N5O3S
Mol. Mass.465.568
SMILESCOc1ccc(Cn2c3sc4CN(CC5CCOCC5)CCc4c3c3ncnn3c2=O)cc1