Reaction Details
TargetPotassium voltage-gated channel subfamily H member 2
LigandBDBM289671
Substrate/Competitorn/a
Meas. Tech.ChEMBL_1661931 (CHEMBL4011543)
IC50 4900±n/a nM
Citation Dyck, BBranstetter, BGharbaoui, THudson, ARBreitenbucher, JGGomez, LBotrous, IMarrone, TBarido, RAllerston, CKCedervall, EPXu, RSridhar, VBarker, RAertgeerts, KSchmelzer, KNeul, DLee, DMassari, MEAndersen, CBSebring, KZhou, XPetroski, RLimberis, JAugustin, MChun, LEEdwards, TEPeters, MTabatabaei, A Discovery of Selective Phosphodiesterase 1 Inhibitors with Memory Enhancing Properties. J Med Chem60:3472-3483 (2017) 
 
Potassium voltage-gated channel subfamily H member 2
Name:Potassium voltage-gated channel subfamily H member 2
Type:Multi-pass membrane protein
Mol. Mass.:126672.65
Organism:Homo sapiens (Human)
Description:Q12809
Residue:1159
BDBM289671
NameBDBM289671
Synonyms:9-(2,2-Difluorocyclopropanecarbonyl)-6-(4-methoxybenzyl)-8,9,10,11-tetrahydropyrido[4',3':4,5]thieno[3,2-e][1,2,4]triazolo[1,5-c]pyrimidin-5(6H)-one US10376514, Example 160
TypeSmall organic molecule
Emp. Form.C22H19F2N5O3S
Mol. Mass.471.48
SMILESCOc1ccc(Cn2c3sc4CN(CCc4c3c3ncnn3c2=O)C(=O)C2CC2(F)F)cc1