Reaction Details
TargetcGMP-specific 3',5'-cyclic phosphodiesterase
LigandBDBM289653
Substrate/Competitorn/a
Meas. Tech.ChEMBL_1661914 (CHEMBL4011526)
IC50 260±n/a nM
Citation Dyck, BBranstetter, BGharbaoui, THudson, ARBreitenbucher, JGGomez, LBotrous, IMarrone, TBarido, RAllerston, CKCedervall, EPXu, RSridhar, VBarker, RAertgeerts, KSchmelzer, KNeul, DLee, DMassari, MEAndersen, CBSebring, KZhou, XPetroski, RLimberis, JAugustin, MChun, LEEdwards, TEPeters, MTabatabaei, A Discovery of Selective Phosphodiesterase 1 Inhibitors with Memory Enhancing Properties. J Med Chem60:3472-3483 (2017) 
 
cGMP-specific 3',5'-cyclic phosphodiesterase
Name:cGMP-specific 3',5'-cyclic phosphodiesterase
Type:Protein
Mol. Mass.:99975.83
Organism:Homo sapiens (Human)
Description:O76074
Residue:875
BDBM289653
NameBDBM289653
Synonyms:6-(2-Fluoro-4-methoxybenzyl)-9-((tetrahydro-2H-pyran-4-yl)methyl)-8,9,10,11-tetrahydropyrido[4',3':4,5]thieno[3,2-e][1,2,4]triazolo[1,5-c]pyrimidin-5 (6H)-one US10376514, Example 141
TypeSmall organic molecule
Emp. Form.C24H26FN5O3S
Mol. Mass.483.558
SMILESCOc1ccc(Cn2c3sc4CN(CC5CCOCC5)CCc4c3c3ncnn3c2=O)c(F)c1