Reaction Details
TargetTyrosyl-DNA phosphodiesterase 1
LigandBDBM50008923
Substrate/Competitorn/a
Meas. Tech.ChEBML_1661954
IC50>111000±n/a nM
Citation Wang, PElsayed, MSAPlescia, CBRavji, ARedon, CEKiselev, EMarchand, CZeleznik, OAgama, KPommier, YCushman, M Synthesis and Biological Evaluation of the First Triple Inhibitors of Human Topoisomerase 1, Tyrosyl-DNA Phosphodiesterase 1 (Tdp1), and Tyrosyl-DNA Phosphodiesterase 2 (Tdp2). J Med Chem60:3275-3288 (2017) 
 
Tyrosyl-DNA phosphodiesterase 1
Name:Tyrosyl-DNA phosphodiesterase 1
Type:Enzyme
Mol. Mass.:68430.66
Organism:Homo sapiens (Human)
Description:Q9NUW8
Residue:608
BDBM50008923
NameBDBM50008923
Synonyms:(S)-4-ethyl-4-hydroxy-1,12-dihydro-4H-2-oxa-6,12a-diaza-dibenzo[b,h]florene-3,13-dione 4-Ethyl-4-hydroxy-1,12-dihydro-4H-2-oxa-6,12a-diaza-dibenzo[b,h]fluorene-3,13-dione 4-Ethyl-4-hydroxy-1,12-dihydro-4H-2-oxa-6,12a-diaza-dibenzo[b,h]fluorene-3,13-dione (Camptothecin) 4-ethyl-4-hydroxy-(4S)-3,4,12,14-tetrahydro-1H-pyrano[3',4':6,7]indolizino[1,2-b]quinoline-3,14-dione Camptothecin (CT) cid_24360
TypeSmall organic molecule
Emp. Form.C20H16N2O4
Mol. Mass.348.352
SMILESCC[C@@]1(O)C(=O)OCc2c1cc1-c3nc4ccccc4cc3Cn1c2=O