Reaction Details
TargetSodium channel protein type 9 subunit alpha
LigandBDBM342932
Substrate/Competitorn/a
Meas. Tech.ChEBML_1662556
IC50 170±n/a nM
Citation Weiss, MMDineen, TAMarx, IEAltmann, SBoezio, ABregman, HChu-Moyer, MDiMauro, EFFeric Bojic, EFoti, RSGao, HGraceffa, RGunaydin, HGuzman-Perez, AHuang, HHuang, LJarosh, MKornecook, TKreiman, CRLigutti, JLa, DSLin, MJLiu, DMoyer, BDNguyen, HNPeterson, EARose, PETaborn, KYoungblood, BDYu, VFremeau, RT Sulfonamides as Selective Na J Med Chem60:5969-5989 (2017) 
 
Sodium channel protein type 9 subunit alpha
Name:Sodium channel protein type 9 subunit alpha
Type:Protein
Mol. Mass.:226375.97
Organism:Homo sapiens (Human)
Description:Q15858
Residue:1988
BDBM342932
NameBDBM342932
Synonyms:1-(3',5'-difluoro-3-methoxy-4-biphenylyl)-N-3-isoxazolyl-6-isoquinolinesulfonamide | US9776995, Example 142
TypeSmall organic molecule
Emp. Form.C25H17F2N3O4S
Mol. Mass.493.482
SMILESCOc1cc(ccc1-c1nccc2cc(ccc12)S(=O)(=O)Nc1ccon1)-c1cc(F)cc(F)c1