Reaction Details
TargetCytochrome P450 3A4
LigandBDBM154315
Substrate/Competitorn/a
Meas. Tech.ChEMBL_1662545 (CHEMBL4012226)
IC50>27000±n/a nM
Citation Weiss, MMDineen, TAMarx, IEAltmann, SBoezio, ABregman, HChu-Moyer, MDiMauro, EFFeric Bojic, EFoti, RSGao, HGraceffa, RGunaydin, HGuzman-Perez, AHuang, HHuang, LJarosh, MKornecook, TKreiman, CRLigutti, JLa, DSLin, MJLiu, DMoyer, BDNguyen, HNPeterson, EARose, PETaborn, KYoungblood, BDYu, VFremeau, RT Sulfonamides as Selective Na J Med Chem60:5969-5989 (2017) 
 
Cytochrome P450 3A4
Name:Cytochrome P450 3A4
Type:Enzyme
Mol. Mass.:57349.57
Organism:Homo sapiens (Human)
Description:n/a
Residue:503
BDBM154315
NameBDBM154315
Synonyms:US9012443, 335
TypeSmall organic molecule
Emp. Form.C25H17ClFN3O4S
Mol. Mass.509.937
SMILESCOc1cc(c(Cl)cc1-c1nccc2cc(ccc12)S(=O)(=O)Nc1ccon1)-c1cccc(F)c1