Reaction Details
TargetCytochrome P450 3A4
LigandBDBM342904
Substrate/Competitorn/a
Meas. Tech.ChEMBL_1662545 (CHEMBL4012226)
IC50>15000±n/a nM
Citation Weiss, MMDineen, TAMarx, IEAltmann, SBoezio, ABregman, HChu-Moyer, MDiMauro, EFFeric Bojic, EFoti, RSGao, HGraceffa, RGunaydin, HGuzman-Perez, AHuang, HHuang, LJarosh, MKornecook, TKreiman, CRLigutti, JLa, DSLin, MJLiu, DMoyer, BDNguyen, HNPeterson, EARose, PETaborn, KYoungblood, BDYu, VFremeau, RT Sulfonamides as Selective Na J Med Chem60:5969-5989 (2017) 
 
Cytochrome P450 3A4
Name:Cytochrome P450 3A4
Type:Enzyme
Mol. Mass.:57349.57
Organism:Homo sapiens (Human)
Description:n/a
Residue:503
BDBM342904
NameBDBM342904
Synonyms:1-(2-fluoro-5-methoxy-3'-(trifluoromethyl)-4-biphenylyl)-N-3-isoxazolyl-6-isoquinolinesulfonamide | US9776995, Example 115
TypeSmall organic molecule
Emp. Form.C26H17F4N3O4S
Mol. Mass.543.489
SMILESCOc1cc(c(F)cc1-c1nccc2cc(ccc12)S(=O)(=O)Nc1ccon1)-c1cccc(c1)C(F)(F)F