Reaction Details
TargetSodium channel protein type 9 subunit alpha
LigandBDBM154315
Substrate/Competitorn/a
Meas. Tech.ChEMBL_1662556 (CHEMBL4012237)
IC50 49±n/a nM
Citation Weiss, MMDineen, TAMarx, IEAltmann, SBoezio, ABregman, HChu-Moyer, MDiMauro, EFFeric Bojic, EFoti, RSGao, HGraceffa, RGunaydin, HGuzman-Perez, AHuang, HHuang, LJarosh, MKornecook, TKreiman, CRLigutti, JLa, DSLin, MJLiu, DMoyer, BDNguyen, HNPeterson, EARose, PETaborn, KYoungblood, BDYu, VFremeau, RT Sulfonamides as Selective Na J Med Chem60:5969-5989 (2017) 
 
Sodium channel protein type 9 subunit alpha
Name:Sodium channel protein type 9 subunit alpha
Type:Protein
Mol. Mass.:226375.97
Organism:Homo sapiens (Human)
Description:Q15858
Residue:1988
BDBM154315
NameBDBM154315
Synonyms:US9012443, 335
TypeSmall organic molecule
Emp. Form.C25H17ClFN3O4S
Mol. Mass.509.937
SMILESCOc1cc(c(Cl)cc1-c1nccc2cc(ccc12)S(=O)(=O)Nc1ccon1)-c1cccc(F)c1