Reaction Details
TargetSodium channel protein type 9 subunit alpha
LigandBDBM342882
Substrate/Competitorn/a
Meas. Tech.ChEMBL_1662556 (CHEMBL4012237)
IC50 40±n/a nM
Citation Weiss, MMDineen, TAMarx, IEAltmann, SBoezio, ABregman, HChu-Moyer, MDiMauro, EFFeric Bojic, EFoti, RSGao, HGraceffa, RGunaydin, HGuzman-Perez, AHuang, HHuang, LJarosh, MKornecook, TKreiman, CRLigutti, JLa, DSLin, MJLiu, DMoyer, BDNguyen, HNPeterson, EARose, PETaborn, KYoungblood, BDYu, VFremeau, RT Sulfonamides as Selective Na J Med Chem60:5969-5989 (2017) 
 
Sodium channel protein type 9 subunit alpha
Name:Sodium channel protein type 9 subunit alpha
Type:Protein
Mol. Mass.:226375.97
Organism:Homo sapiens (Human)
Description:Q15858
Residue:1988
BDBM342882
NameBDBM342882
Synonyms:N-3-isoxazolyl-1-(2,3',5'-trifluoro-5-methoxy-4-biphenylyl)-6-isoquinolinesulfonamide | US9776995, Example 98
TypeSmall organic molecule
Emp. Form.C25H16F3N3O4S
Mol. Mass.511.472
SMILESCOc1cc(c(F)cc1-c1nccc2cc(ccc12)S(=O)(=O)Nc1ccon1)-c1cc(F)cc(F)c1