Reaction Details
TargetSodium channel protein type 9 subunit alpha
LigandBDBM154486
Substrate/Competitorn/a
Meas. Tech.ChEMBL_1662556 (CHEMBL4012237)
IC50 730±n/a nM
Citation Weiss, MMDineen, TAMarx, IEAltmann, SBoezio, ABregman, HChu-Moyer, MDiMauro, EFFeric Bojic, EFoti, RSGao, HGraceffa, RGunaydin, HGuzman-Perez, AHuang, HHuang, LJarosh, MKornecook, TKreiman, CRLigutti, JLa, DSLin, MJLiu, DMoyer, BDNguyen, HNPeterson, EARose, PETaborn, KYoungblood, BDYu, VFremeau, RT Sulfonamides as Selective Na J Med Chem60:5969-5989 (2017) 
 
Sodium channel protein type 9 subunit alpha
Name:Sodium channel protein type 9 subunit alpha
Type:Protein
Mol. Mass.:226375.97
Organism:Homo sapiens (Human)
Description:Q15858
Residue:1988
BDBM154486
NameBDBM154486
Synonyms:US9012443, 67
TypeSmall organic molecule
Emp. Form.C21H15F3N4O3S
Mol. Mass.460.429
SMILESCOc1cc(ccc1-c1nccc2cc(ccc12)S(=O)(=O)Nc1ccncn1)C(F)(F)F