Reaction Details
TargetSodium channel protein type 5 subunit alpha
LigandBDBM342877
Substrate/Competitorn/a
Meas. Tech.ChEMBL_1662520 (CHEMBL4012201)
IC50>10000±n/a nM
Citation Weiss, MMDineen, TAMarx, IEAltmann, SBoezio, ABregman, HChu-Moyer, MDiMauro, EFFeric Bojic, EFoti, RSGao, HGraceffa, RGunaydin, HGuzman-Perez, AHuang, HHuang, LJarosh, MKornecook, TKreiman, CRLigutti, JLa, DSLin, MJLiu, DMoyer, BDNguyen, HNPeterson, EARose, PETaborn, KYoungblood, BDYu, VFremeau, RT Sulfonamides as Selective Na J Med Chem60:5969-5989 (2017) 
 
Sodium channel protein type 5 subunit alpha
Name:Sodium channel protein type 5 subunit alpha
Type:Enzyme
Mol. Mass.:226908.60
Organism:Homo sapiens (Human)
Description:Q14524
Residue:2016
BDBM342877
NameBDBM342877
Synonyms:1-(5-fluoro-4-(5-fluoro-2-methoxy-3-pyridinyl)-2-methoxyphenyl)-N-3-isoxazolyl-6-isoquinolinesulfonamide | US9776995, Example 93
TypeSmall organic molecule
Emp. Form.C25H18F2N4O5S
Mol. Mass.524.496
SMILESCOc1cc(c(F)cc1-c1nccc2cc(ccc12)S(=O)(=O)Nc1ccon1)-c1cc(F)cnc1OC