Reaction Details
TargetPotassium voltage-gated channel subfamily H member 2
LigandBDBM342904
Substrate/Competitorn/a
Meas. Tech.ChEMBL_1662549 (CHEMBL4012230)
IC50>10000±n/a nM
Citation Weiss, MMDineen, TAMarx, IEAltmann, SBoezio, ABregman, HChu-Moyer, MDiMauro, EFFeric Bojic, EFoti, RSGao, HGraceffa, RGunaydin, HGuzman-Perez, AHuang, HHuang, LJarosh, MKornecook, TKreiman, CRLigutti, JLa, DSLin, MJLiu, DMoyer, BDNguyen, HNPeterson, EARose, PETaborn, KYoungblood, BDYu, VFremeau, RT Sulfonamides as Selective Na J Med Chem60:5969-5989 (2017) 
 
Potassium voltage-gated channel subfamily H member 2
Name:Potassium voltage-gated channel subfamily H member 2
Type:Multi-pass membrane protein
Mol. Mass.:126672.65
Organism:Homo sapiens (Human)
Description:Q12809
Residue:1159
BDBM342904
NameBDBM342904
Synonyms:1-(2-fluoro-5-methoxy-3'-(trifluoromethyl)-4-biphenylyl)-N-3-isoxazolyl-6-isoquinolinesulfonamide | US9776995, Example 115
TypeSmall organic molecule
Emp. Form.C26H17F4N3O4S
Mol. Mass.543.489
SMILESCOc1cc(c(F)cc1-c1nccc2cc(ccc12)S(=O)(=O)Nc1ccon1)-c1cccc(c1)C(F)(F)F