Reaction Details
TargetAlkaline phosphatase, tissue-nonspecific isozyme
LigandBDBM50237922
Substrate/Competitorn/a
Meas. Tech.ChEMBL_1662569 (CHEMBL4012250)
IC50 9010±n/a nM
Citation Salar, UKhan, KMIqbal, JEjaz, SAHameed, AAl-Rashida, MPerveen, STahir, MN Coumarin sulfonates: New alkaline phosphatase inhibitors; in vitro and in silico studies. Eur J Med Chem131:29-47 (2017) 
 
Alkaline phosphatase, tissue-nonspecific isozyme
Name:Alkaline phosphatase, tissue-nonspecific isozyme
Type:PROTEIN
Mol. Mass.:57306.17
Organism:Homo sapiens (Human)
Description:ChEMBL_1448917
Residue:524
BDBM50237922
NameBDBM50237922
Synonyms:CHEMBL4103420
TypeSmall organic molecule
Emp. Form.C17H13ClO6S
Mol. Mass.380.8
SMILESCOc1ccc(cc1)S(=O)(=O)Oc1ccc2c(C)c(Cl)c(=O)oc2c1