Reaction Details
TargetAlkaline phosphatase, tissue-nonspecific isozyme
LigandBDBM50237925
Substrate/Competitorn/a
Meas. Tech.ChEMBL_1662569 (CHEMBL4012250)
IC50 580±n/a nM
Citation Salar, UKhan, KMIqbal, JEjaz, SAHameed, AAl-Rashida, MPerveen, STahir, MN Coumarin sulfonates: New alkaline phosphatase inhibitors; in vitro and in silico studies. Eur J Med Chem131:29-47 (2017) 
 
Alkaline phosphatase, tissue-nonspecific isozyme
Name:Alkaline phosphatase, tissue-nonspecific isozyme
Type:PROTEIN
Mol. Mass.:57306.17
Organism:Homo sapiens (Human)
Description:ChEMBL_1448917
Residue:524
BDBM50237925
NameBDBM50237925
Synonyms:CHEMBL4103223
TypeSmall organic molecule
Emp. Form.C18H13NO6S
Mol. Mass.371.364
SMILESCOc1ccc(cc1)S(=O)(=O)Oc1ccc2c(C)c(C#N)c(=O)oc2c1