Reaction Details
TargetAlkaline phosphatase, tissue-nonspecific isozyme
LigandBDBM50237942
Substrate/Competitorn/a
Meas. Tech.ChEMBL_1662569 (CHEMBL4012250)
IC50 1070±n/a nM
Citation Salar, UKhan, KMIqbal, JEjaz, SAHameed, AAl-Rashida, MPerveen, STahir, MN Coumarin sulfonates: New alkaline phosphatase inhibitors; in vitro and in silico studies. Eur J Med Chem131:29-47 (2017) 
 
Alkaline phosphatase, tissue-nonspecific isozyme
Name:Alkaline phosphatase, tissue-nonspecific isozyme
Type:PROTEIN
Mol. Mass.:57306.17
Organism:Homo sapiens (Human)
Description:ChEMBL_1448917
Residue:524
BDBM50237942
NameBDBM50237942
Synonyms:CHEMBL4078955
TypeSmall organic molecule
Emp. Form.C17H10N2O7S
Mol. Mass.386.335
SMILESCc1c(C#N)c(=O)oc2cc(OS(=O)(=O)c3ccccc3[N+]([O-])=O)ccc12