Reaction Details
TargetIntestinal-type alkaline phosphatase
LigandBDBM50237922
Substrate/Competitorn/a
Meas. Tech.ChEMBL_1662570 (CHEMBL4012251)
IC50 2130±n/a nM
Citation Salar, UKhan, KMIqbal, JEjaz, SAHameed, AAl-Rashida, MPerveen, STahir, MN Coumarin sulfonates: New alkaline phosphatase inhibitors; in vitro and in silico studies. Eur J Med Chem131:29-47 (2017) 
 
Intestinal-type alkaline phosphatase
Name:Intestinal-type alkaline phosphatase
Type:PROTEIN
Mol. Mass.:56804.94
Organism:Homo sapiens (Human)
Description:ChEMBL_1278525
Residue:528
BDBM50237922
NameBDBM50237922
Synonyms:CHEMBL4103420
TypeSmall organic molecule
Emp. Form.C17H13ClO6S
Mol. Mass.380.8
SMILESCOc1ccc(cc1)S(=O)(=O)Oc1ccc2c(C)c(Cl)c(=O)oc2c1