Reaction Details
TargetIntestinal-type alkaline phosphatase
LigandBDBM50237941
Substrate/Competitorn/a
Meas. Tech.ChEMBL_1662570 (CHEMBL4012251)
IC50 3580±n/a nM
Citation Salar, UKhan, KMIqbal, JEjaz, SAHameed, AAl-Rashida, MPerveen, STahir, MN Coumarin sulfonates: New alkaline phosphatase inhibitors; in vitro and in silico studies. Eur J Med Chem131:29-47 (2017) 
 
Intestinal-type alkaline phosphatase
Name:Intestinal-type alkaline phosphatase
Type:PROTEIN
Mol. Mass.:56804.94
Organism:Homo sapiens (Human)
Description:ChEMBL_1278525
Residue:528
BDBM50237941
NameBDBM50237941
Synonyms:CHEMBL4073985
TypeSmall organic molecule
Emp. Form.C11H9ClO5S
Mol. Mass.288.704
SMILESCc1c(Cl)c(=O)oc2cc(OS(C)(=O)=O)ccc12