Reaction Details
TargetCytochrome P450 2C9
LigandBDBM217819
Substrate/Competitorn/a
Meas. Tech.ChEMBL_1662649 (CHEMBL4012330)
IC50 13000±n/a nM
Citation Graceffa, RFBoezio, AAAble, JAltmann, SBerry, LMBoezio, CButler, JRChu-Moyer, MCooke, MDiMauro, EFDineen, TAFeric Bojic, EFoti, RSFremeau, RTGuzman-Perez, AGao, HGunaydin, HHuang, HHuang, LIlch, CJarosh, MKornecook, TKreiman, CRLa, DSLigutti, JMilgram, BCLin, MJMarx, IENguyen, HNPeterson, EARescourio, GRoberts, JSchenkel, LShimanovich, RSparling, BAStellwagen, JTaborn, KVaida, KRWang, JYeoman, JYu, VZhu, DMoyer, BDWeiss, MM Sulfonamides as Selective Na J Med Chem60:5990-6017 (2017) 
 
Cytochrome P450 2C9
Name:Cytochrome P450 2C9
Type:Enzyme
Mol. Mass.:55636.33
Organism:Homo sapiens (Human)
Description:P11712
Residue:490
BDBM217819
NameBDBM217819
Synonyms:US9212182, 685
TypeSmall organic molecule
Emp. Form.C27H20ClFN4O5S
Mol. Mass.566.988
SMILESCOc1cc(ccc1Cl)-c1cc(OC)c(cc1F)-n1c2ccc(cc2ccc1=O)S(=O)(=O)Nc1ncccn1