Reaction Details
TargetSodium channel protein type 9 subunit alpha
LigandBDBM217725
Substrate/Competitorn/a
Meas. Tech.ChEMBL_1662647 (CHEMBL4012328)
IC50 7±n/a nM
Citation Graceffa, RFBoezio, AAAble, JAltmann, SBerry, LMBoezio, CButler, JRChu-Moyer, MCooke, MDiMauro, EFDineen, TAFeric Bojic, EFoti, RSFremeau, RTGuzman-Perez, AGao, HGunaydin, HHuang, HHuang, LIlch, CJarosh, MKornecook, TKreiman, CRLa, DSLigutti, JMilgram, BCLin, MJMarx, IENguyen, HNPeterson, EARescourio, GRoberts, JSchenkel, LShimanovich, RSparling, BAStellwagen, JTaborn, KVaida, KRWang, JYeoman, JYu, VZhu, DMoyer, BDWeiss, MM Sulfonamides as Selective Na J Med Chem60:5990-6017 (2017) 
 
Sodium channel protein type 9 subunit alpha
Name:Sodium channel protein type 9 subunit alpha
Type:Protein
Mol. Mass.:226375.97
Organism:Homo sapiens (Human)
Description:Q15858
Residue:1988
BDBM217725
NameBDBM217725
Synonyms:US9212182, 652 US9212182, 654
TypeSmall organic molecule
Emp. Form.C25H18ClFN4O5S
Mol. Mass.540.951
SMILESCOc1cc(c(F)cc1-n1c2ccc(cc2ncc1=O)S(=O)(=O)Nc1ccon1)-c1ccc(Cl)c(C)c1