Reaction Details
TargetCytochrome P450 2C9
LigandBDBM342945
Substrate/Competitorn/a
Meas. Tech.ChEMBL_1662649 (CHEMBL4012330)
IC50 560±n/a nM
Citation Graceffa, RFBoezio, AAAble, JAltmann, SBerry, LMBoezio, CButler, JRChu-Moyer, MCooke, MDiMauro, EFDineen, TAFeric Bojic, EFoti, RSFremeau, RTGuzman-Perez, AGao, HGunaydin, HHuang, HHuang, LIlch, CJarosh, MKornecook, TKreiman, CRLa, DSLigutti, JMilgram, BCLin, MJMarx, IENguyen, HNPeterson, EARescourio, GRoberts, JSchenkel, LShimanovich, RSparling, BAStellwagen, JTaborn, KVaida, KRWang, JYeoman, JYu, VZhu, DMoyer, BDWeiss, MM Sulfonamides as Selective Na J Med Chem60:5990-6017 (2017) 
 
Cytochrome P450 2C9
Name:Cytochrome P450 2C9
Type:Enzyme
Mol. Mass.:55636.33
Organism:Homo sapiens (Human)
Description:P11712
Residue:490
BDBM342945
NameBDBM342945
Synonyms:1-(2,3''-difluoro-5-methoxy-4-biphenylyl)-N-3-isoxazolyl-2-oxo-1,2-dihydro-6-quinolinesulfonamide US9776995, Example 299 | US9776995, Example 42
TypeSmall organic molecule
Emp. Form.C25H17F2N3O5S
Mol. Mass.509.481
SMILESCOc1cc(c(F)cc1-n1c2ccc(cc2ccc1=O)S(=O)(=O)Nc1ccon1)-c1cccc(F)c1