Reaction Details
TargetCytochrome P450 3A4
LigandBDBM217889
Substrate/Competitorn/a
Meas. Tech.ChEMBL_1662700 (CHEMBL4012381)
IC50>50000±n/a nM
Citation Graceffa, RFBoezio, AAAble, JAltmann, SBerry, LMBoezio, CButler, JRChu-Moyer, MCooke, MDiMauro, EFDineen, TAFeric Bojic, EFoti, RSFremeau, RTGuzman-Perez, AGao, HGunaydin, HHuang, HHuang, LIlch, CJarosh, MKornecook, TKreiman, CRLa, DSLigutti, JMilgram, BCLin, MJMarx, IENguyen, HNPeterson, EARescourio, GRoberts, JSchenkel, LShimanovich, RSparling, BAStellwagen, JTaborn, KVaida, KRWang, JYeoman, JYu, VZhu, DMoyer, BDWeiss, MM Sulfonamides as Selective Na J Med Chem60:5990-6017 (2017) 
 
Cytochrome P450 3A4
Name:Cytochrome P450 3A4
Type:Enzyme
Mol. Mass.:57349.57
Organism:Homo sapiens (Human)
Description:n/a
Residue:503
BDBM217889
NameBDBM217889
Synonyms:US9212182, 632
TypeSmall organic molecule
Emp. Form.C26H18F3N3O6S
Mol. Mass.557.498
SMILESCOc1cc(c(F)cc1-n1c2ccc(cc2ccc1=O)S(=O)(=O)Nc1ccon1)-c1cccc(OC(F)F)c1