Reaction Details
TargetKynurenine 3-monooxygenase
LigandBDBM50238006
Substrate/Competitorn/a
Meas. Tech.ChEMBL_1662711 (CHEMBL4012392)
IC50 631±n/a nM
Citation Liddle, JBeaufils, BBinnie, MBouillot, ADenis, AAHann, MMHaslam, CPHolmes, DSHutchinson, JPKranz, MMcBride, AMirguet, OMole, DJMowat, CGPal, SRowland, PTrottet, LUings, IJWalker, ALWebster, SP The discovery of potent and selective kynurenine 3-monooxygenase inhibitors for the treatment of acute pancreatitis. Bioorg Med Chem Lett27:2023-2028 (2017) 
 
Kynurenine 3-monooxygenase
Name:Kynurenine 3-monooxygenase
Type:PROTEIN
Mol. Mass.:55831.03
Organism:Homo sapiens (Human)
Description:ChEMBL_1487479
Residue:486
BDBM50238006
NameBDBM50238006
Synonyms:CHEMBL4105465
TypeSmall organic molecule
Emp. Form.C11H8N2O4
Mol. Mass.232.1922
SMILESOC(=O)CCn1c2cc(ccc2oc1=O)C#N