Reaction Details
TargetKynurenine 3-monooxygenase
LigandBDBM50083950
Substrate/Competitorn/a
Meas. Tech.ChEMBL_1662733 (CHEMBL4012414)
IC50 900±n/a nM
Citation Liddle, JBeaufils, BBinnie, MBouillot, ADenis, AAHann, MMHaslam, CPHolmes, DSHutchinson, JPKranz, MMcBride, AMirguet, OMole, DJMowat, CGPal, SRowland, PTrottet, LUings, IJWalker, ALWebster, SP The discovery of potent and selective kynurenine 3-monooxygenase inhibitors for the treatment of acute pancreatitis. Bioorg Med Chem Lett27:2023-2028 (2017) 
 
Kynurenine 3-monooxygenase
Name:Kynurenine 3-monooxygenase
Type:PROTEIN
Mol. Mass.:54371.88
Organism:Rattus norvegicus
Description:ChEMBL_1487468
Residue:478
BDBM50083950
NameBDBM50083950
Synonyms:(S)-(+)-2-Amino-4-(3-nitro-phenyl)-4-oxo-butyric acid[(S)-(+)-m-nicotinylbenzoylalanine] CHEMBL22740
TypeSmall organic molecule
Emp. Form.C10H10N2O5
Mol. Mass.238.1968
SMILESN[C@@H](CC(=O)c1cccc(c1)[N+]([O-])=O)C(O)=O