Reaction Details
TargetKynurenine 3-monooxygenase
LigandBDBM50237998
Substrate/Competitorn/a
Meas. Tech.ChEMBL_1662734 (CHEMBL4012415)
IC50 500±n/a nM
Citation Liddle, JBeaufils, BBinnie, MBouillot, ADenis, AAHann, MMHaslam, CPHolmes, DSHutchinson, JPKranz, MMcBride, AMirguet, OMole, DJMowat, CGPal, SRowland, PTrottet, LUings, IJWalker, ALWebster, SP The discovery of potent and selective kynurenine 3-monooxygenase inhibitors for the treatment of acute pancreatitis. Bioorg Med Chem Lett27:2023-2028 (2017) 
 
Kynurenine 3-monooxygenase
Name:Kynurenine 3-monooxygenase
Type:PROTEIN
Mol. Mass.:50713.22
Organism:Pseudomonas fluorescens
Description:ChEMBL_117445
Residue:461
BDBM50237998
NameBDBM50237998
Synonyms:CHEMBL1881960
TypeSmall organic molecule
Emp. Form.C7H3Cl2NO2
Mol. Mass.204.01
SMILESOc1nc2cc(Cl)c(Cl)cc2o1