Reaction Details
TargetKynurenine 3-monooxygenase
LigandBDBM50237999
Substrate/Competitorn/a
Meas. Tech.ChEMBL_1662736 (CHEMBL4012417)
IC50 1259±n/a nM
Citation Liddle, JBeaufils, BBinnie, MBouillot, ADenis, AAHann, MMHaslam, CPHolmes, DSHutchinson, JPKranz, MMcBride, AMirguet, OMole, DJMowat, CGPal, SRowland, PTrottet, LUings, IJWalker, ALWebster, SP The discovery of potent and selective kynurenine 3-monooxygenase inhibitors for the treatment of acute pancreatitis. Bioorg Med Chem Lett27:2023-2028 (2017) 
 
Kynurenine 3-monooxygenase
Name:Kynurenine 3-monooxygenase
Type:PROTEIN
Mol. Mass.:54371.88
Organism:Rattus norvegicus
Description:ChEMBL_1487468
Residue:478
BDBM50237999
NameBDBM50237999
Synonyms:CHEMBL4064834
TypeSmall organic molecule
Emp. Form.C12H17ClN2O5
Mol. Mass.304.727
SMILESNC(CO)(CO)CO.Cc1cc2oc(=O)[nH]c2cc1Cl