Reaction Details
TargetTGF-beta receptor type-1
LigandBDBM50238066
Substrate/Competitorn/a
Meas. Tech.ChEMBL_1662763 (CHEMBL4012444)
IC50 13±n/a nM
Citation Sabat, MWang, HScorah, NLawson, JDAtienza, JKamran, RHixon, MSDougan, DR Design, synthesis and optimization of 7-substituted-pyrazolo[4,3-b]pyridine ALK5 (activin receptor-like kinase 5) inhibitors. Bioorg Med Chem Lett27:1955-1961 (2017) 
 
TGF-beta receptor type-1
Name:TGF-beta receptor type-1
Type:enzyme
Mol. Mass.:55968.24
Organism:Homo sapiens (Human)
Description:P36897
Residue:503
BDBM50238066
NameBDBM50238066
Synonyms:CHEMBL4072325
TypeSmall organic molecule
Emp. Form.C20H16ClFN6O
Mol. Mass.410.832
SMILESCc1cnc(cc1Nc1ccnc2cnn(CC(N)=O)c12)-c1cc(Cl)ccc1F