Reaction Details
TargetTGF-beta receptor type-1
LigandBDBM50238085
Substrate/Competitorn/a
Meas. Tech.ChEMBL_1662763 (CHEMBL4012444)
IC50 631±n/a nM
Citation Sabat, MWang, HScorah, NLawson, JDAtienza, JKamran, RHixon, MSDougan, DR Design, synthesis and optimization of 7-substituted-pyrazolo[4,3-b]pyridine ALK5 (activin receptor-like kinase 5) inhibitors. Bioorg Med Chem Lett27:1955-1961 (2017) 
 
TGF-beta receptor type-1
Name:TGF-beta receptor type-1
Type:enzyme
Mol. Mass.:55968.24
Organism:Homo sapiens (Human)
Description:P36897
Residue:503
BDBM50238085
NameBDBM50238085
Synonyms:CHEMBL4086498
TypeSmall organic molecule
Emp. Form.C21H17N3O
Mol. Mass.327.3792
SMILESCOc1cccc2nccc(Nc3ccnc(c3)-c3ccccc3)c12