Reaction Details
TargetTGF-beta receptor type-1
LigandBDBM50238081
Substrate/Competitorn/a
Meas. Tech.ChEMBL_1662763 (CHEMBL4012444)
IC50 16±n/a nM
Citation Sabat, MWang, HScorah, NLawson, JDAtienza, JKamran, RHixon, MSDougan, DR Design, synthesis and optimization of 7-substituted-pyrazolo[4,3-b]pyridine ALK5 (activin receptor-like kinase 5) inhibitors. Bioorg Med Chem Lett27:1955-1961 (2017) 
 
TGF-beta receptor type-1
Name:TGF-beta receptor type-1
Type:enzyme
Mol. Mass.:55968.24
Organism:Homo sapiens (Human)
Description:P36897
Residue:503
BDBM50238081
NameBDBM50238081
Synonyms:CHEMBL4084771
TypeSmall organic molecule
Emp. Form.C18H13ClFN5
Mol. Mass.353.781
SMILESCc1cnc(cc1Nc1ccnc2cn[nH]c12)-c1cc(Cl)ccc1F