Reaction Details
TargetCytochrome P450 3A4
LigandBDBM50238082
Substrate/Competitorn/a
Meas. Tech.ChEMBL_1662772 (CHEMBL4012453)
IC50 1585±n/a nM
Citation Sabat, MWang, HScorah, NLawson, JDAtienza, JKamran, RHixon, MSDougan, DR Design, synthesis and optimization of 7-substituted-pyrazolo[4,3-b]pyridine ALK5 (activin receptor-like kinase 5) inhibitors. Bioorg Med Chem Lett27:1955-1961 (2017) 
 
Cytochrome P450 3A4
Name:Cytochrome P450 3A4
Type:Enzyme
Mol. Mass.:57349.57
Organism:Homo sapiens (Human)
Description:n/a
Residue:503
BDBM50238082
NameBDBM50238082
Synonyms:CHEMBL4102696
TypeSmall organic molecule
Emp. Form.C18H13F2N5
Mol. Mass.337.3261
SMILESCc1cnc(cc1Nc1ccnc2cn[nH]c12)-c1cc(F)ccc1F