Reaction Details
TargetTGF-beta receptor type-1
LigandBDBM50238083
Substrate/Competitorn/a
Meas. Tech.ChEMBL_1662765 (CHEMBL4012446)
EC50 1259±n/a nM
Citation Sabat, MWang, HScorah, NLawson, JDAtienza, JKamran, RHixon, MSDougan, DR Design, synthesis and optimization of 7-substituted-pyrazolo[4,3-b]pyridine ALK5 (activin receptor-like kinase 5) inhibitors. Bioorg Med Chem Lett27:1955-1961 (2017) 
 
TGF-beta receptor type-1
Name:TGF-beta receptor type-1
Type:enzyme
Mol. Mass.:55968.24
Organism:Homo sapiens (Human)
Description:P36897
Residue:503
BDBM50238083
NameBDBM50238083
Synonyms:CHEMBL4089166
TypeSmall organic molecule
Emp. Form.C19H14F2N6O
Mol. Mass.380.3509
SMILESNC(=O)Cn1ncc2nccc(Nc3ccnc(c3)-c3cc(F)ccc3F)c12