Reaction Details
TargetTGF-beta receptor type-1
LigandBDBM50238080
Substrate/Competitorn/a
Meas. Tech.ChEMBL_1662763 (CHEMBL4012444)
IC50 6.3±n/a nM
Citation Sabat, MWang, HScorah, NLawson, JDAtienza, JKamran, RHixon, MSDougan, DR Design, synthesis and optimization of 7-substituted-pyrazolo[4,3-b]pyridine ALK5 (activin receptor-like kinase 5) inhibitors. Bioorg Med Chem Lett27:1955-1961 (2017) 
 
TGF-beta receptor type-1
Name:TGF-beta receptor type-1
Type:enzyme
Mol. Mass.:55968.24
Organism:Homo sapiens (Human)
Description:P36897
Residue:503
BDBM50238080
NameBDBM50238080
Synonyms:CHEMBL4073422
TypeSmall organic molecule
Emp. Form.C17H11ClFN5
Mol. Mass.339.754
SMILESFc1ccc(Cl)cc1-c1cc(Nc2ccnc3cn[nH]c23)ccn1