Reaction Details
TargetCytochrome P450 11B1, mitochondrial
LigandBDBM50238103
Substrate/Competitorn/a
Meas. Tech.ChEBML_1662802
IC50 6.0±n/a nM
Citation Meguro, MMiyauchi, SKanao, YNaito, SSuzuki, KInoue, SYamada, KHomma, TChiba, KNara, FFuruzono, S 4-Anilino-pyrimidine, novel aldosterone synthase (CYP11B2) inhibitors bearing pyrimidine structures. Bioorg Med Chem Lett27:1902-1906 (2017) 
 
Cytochrome P450 11B1, mitochondrial
Name:Cytochrome P450 11B1, mitochondrial
Type:Enzyme
Mol. Mass.:57591.44
Organism:Homo sapiens (Human)
Description:P15538
Residue:503
BDBM50238103
NameBDBM50238103
Synonyms:CHEMBL4070323
TypeSmall organic molecule
Emp. Form.C18H23FN4O3S
Mol. Mass.394.464
SMILESCC(O)(C1CCN(CC1)S(C)(=O)=O)c1cncnc1Nc1ccc(F)cc1