Reaction Details
TargetAndrogen receptor
LigandBDBM50238126
Substrate/Competitorn/a
Meas. Tech.ChEMBL_1662820 (CHEMBL4012501)
IC50 0.320000±n/a nM
Citation Asano, MHitaka, TImada, TYamada, MMorimoto, MShinohara, HHara, TYamaoka, MSantou, TNakayama, MImai, YHabuka, NYano, JWilson, KFujita, HHasuoka, A Synthesis and biological evaluation of novel selective androgen receptor modulators (SARMs). Part II: Optimization of 4-(pyrrolidin-1-yl)benzonitrile derivatives. Bioorg Med Chem Lett27:1897-1901 (2017) 
 
Androgen receptor
Name:Androgen receptor
Type:Receptor
Mol. Mass.:99185.27
Organism:Homo sapiens (Human)
Description:CHO cells were stably transfected with human AR gene.
Residue:920
BDBM50238126
NameBDBM50238126
Synonyms:CHEMBL4068946
TypeSmall organic molecule
Emp. Form.C13H15ClN2O
Mol. Mass.250.724
SMILESC[C@@H]1N(CC[C@]1(C)O)c1ccc(C#N)c(Cl)c1