Reaction Details
Target72 kDa type IV collagenase
LigandBDBM194644
Substrate/Competitorn/a
Meas. Tech.ChEMBL_1663586 (CHEMBL4013267)
IC50 35000±n/a nM
Citation Durham, TBMarimuthu, JToth, JLLiu, CAdams, LMudra, DRSwearingen, CLin, CChambers, MGThirunavukkarasu, KWiley, MR A Highly Selective Hydantoin Inhibitor of Aggrecanase-1 and Aggrecanase-2 with a Low Projected Human Dose. J Med Chem60:5933-5939 (2017) 
 
72 kDa type IV collagenase
Name:72 kDa type IV collagenase
Type:Enzyme
Mol. Mass.:73870.36
Organism:Homo sapiens (Human)
Description: P08253
Residue:660
BDBM194644
NameBDBM194644
Synonyms:US9206139, 3
TypeSmall organic molecule
Emp. Form.C20H22F3N3O3
Mol. Mass.409.4022
SMILESFC(F)(F)c1ccc(C[C@@H](C2CC2)C(=O)NC[C@]2(NC(=O)NC2=O)C2CC2)cc1