Reaction Details
TargetA disintegrin and metalloproteinase with thrombospondin motifs 5
LigandBDBM194645
Substrate/Competitorn/a
Meas. Tech.ChEMBL_1663585 (CHEMBL4013266)
IC50 150±n/a nM
Citation Durham, TBMarimuthu, JToth, JLLiu, CAdams, LMudra, DRSwearingen, CLin, CChambers, MGThirunavukkarasu, KWiley, MR A Highly Selective Hydantoin Inhibitor of Aggrecanase-1 and Aggrecanase-2 with a Low Projected Human Dose. J Med Chem60:5933-5939 (2017) 
 
A disintegrin and metalloproteinase with thrombospondin motifs 5
Name:A disintegrin and metalloproteinase with thrombospondin motifs 5
Type:Enzyme
Mol. Mass.:101769.09
Organism:Homo sapiens (Human)
Description:Q9UNA0
Residue:930
BDBM194645
NameBDBM194645
Synonyms:US9206139, 4
TypeSmall organic molecule
Emp. Form.C20H24F3N3O3
Mol. Mass.411.4181
SMILESCC(C)[C@H](Cc1ccc(cc1)C(F)(F)F)C(=O)NC[C@]1(NC(=O)NC1=O)C1CC1