Reaction Details
TargetMacrophage metalloelastase
LigandBDBM194645
Substrate/Competitorn/a
Meas. Tech.ChEMBL_1663588 (CHEMBL4013269)
IC50 3400±n/a nM
Citation Durham, TBMarimuthu, JToth, JLLiu, CAdams, LMudra, DRSwearingen, CLin, CChambers, MGThirunavukkarasu, KWiley, MR A Highly Selective Hydantoin Inhibitor of Aggrecanase-1 and Aggrecanase-2 with a Low Projected Human Dose. J Med Chem60:5933-5939 (2017) 
 
Macrophage metalloelastase
Name:Macrophage metalloelastase
Type:Enzyme
Mol. Mass.:54012.99
Organism:Homo sapiens (Human)
Description:P39900
Residue:470
BDBM194645
NameBDBM194645
Synonyms:US9206139, 4
TypeSmall organic molecule
Emp. Form.C20H24F3N3O3
Mol. Mass.411.4181
SMILESCC(C)[C@H](Cc1ccc(cc1)C(F)(F)F)C(=O)NC[C@]1(NC(=O)NC1=O)C1CC1